Reaction Details
TargetGlucocorticoid receptor
LigandBDBM50219445
Substrate/Competitorn/a
Meas. Tech.ChEMBL_448942 (CHEMBL899205)
IC50 58±n/a nM
Citation Kuzmich, DKirrane, TProudfoot, JBekkali, YZindell, RBeck, LNelson, RShih, CKKukulka, AJPaw, ZReilly, PDeleon, RCardozo, MNabozny, GThomson, D Identification of dissociated non-steroidal glucocorticoid receptor agonists. Bioorg Med Chem Lett17:5025-31 (2007) 
 
Glucocorticoid receptor
Name:Glucocorticoid receptor
Type:Enzyme
Mol. Mass.:85656.87
Organism:Homo sapiens (Human)
Description:P04150
Residue:777
BDBM50219445
NameBDBM50219445
Synonyms:1,1,1-trifluoro-4-(5-fluoro-2-methoxyphenyl)-4-methyl-2-((4-methylnaphthalen-1-yl)methyl)pentan-2-ol | CHEMBL235280
TypeSmall organic molecule
Emp. Form.C25H26F4O2
Mol. Mass.434.4664
SMILESCOc1ccc(F)cc1C(C)(C)CC(O)(Cc1ccc(C)c2ccccc12)C(F)(F)F