Reaction Details
TargetMineralocorticoid receptor
LigandBDBM50219466
Substrate/Competitorn/a
Meas. Tech.ChEMBL_448944 (CHEMBL899207)
IC50 450±n/a nM
Citation Kuzmich, DKirrane, TProudfoot, JBekkali, YZindell, RBeck, LNelson, RShih, CKKukulka, AJPaw, ZReilly, PDeleon, RCardozo, MNabozny, GThomson, D Identification of dissociated non-steroidal glucocorticoid receptor agonists. Bioorg Med Chem Lett17:5025-31 (2007) 
 
Mineralocorticoid receptor
Name:Mineralocorticoid receptor
Type:Enzyme
Mol. Mass.:107076.42
Organism:Homo sapiens (Human)
Description:P08235
Residue:984
BDBM50219466
NameBDBM50219466
Synonyms:1,1,1-trifluoro-4-(5-fluoro-2-methoxyphenyl)-4-methyl-2-((2-methylnaphthalen-1-yl)methyl)pentan-2-ol | CHEMBL236754
TypeSmall organic molecule
Emp. Form.C25H26F4O2
Mol. Mass.434.4664
SMILESCOc1ccc(F)cc1C(C)(C)CC(O)(Cc1c(C)ccc2ccccc12)C(F)(F)F