Reaction Details
TargetCarbonic anhydrase 3
LigandBDBM11625
Substrate/Competitorn/a
Meas. Tech.ChEMBL_449604 (CHEMBL898699)
Ki 80500±n/a nM
Citation Nishimori, IMinakuchi, TOnishi, SVullo, DCecchi, AScozzafava, ASupuran, CT Carbonic anhydrase inhibitors: cloning, characterization, and inhibition studies of the cytosolic isozyme III with sulfonamides. Bioorg Med Chem15:7229-36 (2007) 
 
Carbonic anhydrase 3
Name:Carbonic anhydrase 3
Type:Enzyme
Mol. Mass.:29562.11
Organism:Homo sapiens (Human)
Description:Human cloned isozyme.
Residue:260
BDBM11625
NameBDBM11625
Synonyms:2-N-(4-amino-3-chloro-5-fluorobenzene)-1,3,4-thiadiazole-2,5-disulfonamide CHEMBL71611 | aminobenzolamide 18
TypeSmall organic molecule
Emp. Form.C8H7ClFN5O4S3
Mol. Mass.387.819
SMILESNc1c(F)cc(cc1Cl)S(=O)(=O)Nc1nnc(s1)S(N)(=O)=O