Reaction Details
TargetCarbonic anhydrase 3
LigandBDBM10877
Substrate/Competitorn/a
Meas. Tech.ChEMBL_449604 (CHEMBL898699)
Ki 1187000±n/a nM
Citation Nishimori, IMinakuchi, TOnishi, SVullo, DCecchi, AScozzafava, ASupuran, CT Carbonic anhydrase inhibitors: cloning, characterization, and inhibition studies of the cytosolic isozyme III with sulfonamides. Bioorg Med Chem15:7229-36 (2007) 
 
Carbonic anhydrase 3
Name:Carbonic anhydrase 3
Type:Enzyme
Mol. Mass.:29562.11
Organism:Homo sapiens (Human)
Description:Human cloned isozyme.
Residue:260
BDBM10877
NameBDBM10877
Synonyms:4-(2-hydroxyethyl)benzene-1-sulfonamide JMC522226 Compound 21 aromatic/heteroaromatic sulfonamide 22
TypeSmall organic molecule
Emp. Form.C8H11NO3S
Mol. Mass.201.243
SMILESNS(=O)(=O)c1ccc(CCO)cc1