Reaction Details
TargetSigma non-opioid intracellular receptor 1
LigandBDBM50225871
Substrate/Competitorn/a
Meas. Tech.ChEMBL_451646 (CHEMBL901857)
Ki 6.5±n/a nM
Citation Geiger, CZelenka, CWeigl, MFröhlich, RWibbeling, BLehmkuhl, KSchepmann, DGrünert, RBednarski, PJWünsch, B Synthesis of bicyclic sigma receptor ligands with cytotoxic activity. J Med Chem50:6144-53 (2007) 
 
Sigma non-opioid intracellular receptor 1
Name:Sigma non-opioid intracellular receptor 1
Type:Protein
Mol. Mass.:25307.17
Organism:Cavia porcellus (Guinea pig)
Description:Q60492
Residue:223
BDBM50225871
NameBDBM50225871
Synonyms:(+)-(1R,2R,5S)-6-Benzyl-8-(4-methoxybenzyl)-6,8-diazabicyclo-[3.2.2]nonan-2-ol CHEMBL238176
TypeSmall organic molecule
Emp. Form.C22H28N2O2
Mol. Mass.352.4699
SMILESCOc1ccc(CN2C[C@@H]3CC[C@@H](O)[C@H]2CN3Cc2ccccc2)cc1