Reaction Details
TargetP2Y purinoceptor 2
LigandBDBM50195825
Substrate/Competitorn/a
Meas. Tech.ChEMBL_453274 (CHEMBL902429)
EC50 5±n/a nM
Citation Davenport, RJDiaz, PGalvin, FCLloyd, SMack, SROwens, RSabin, VWynn, J Novel nucleotide triphosphates as potent P2Y2 agonists with enhanced stability over UTP. Bioorg Med Chem Lett17:558-61 (2007) 
 
P2Y purinoceptor 2
Name:P2Y purinoceptor 2
Type:PROTEIN
Mol. Mass.:42299.21
Organism:Homo sapiens (Human)
Description:ChEMBL_1455361
Residue:377
BDBM50195825
NameBDBM50195825
Synonyms:({[({[(2R,3S,4R,5R)-5-(7-fluoro-1-oxo-1,2-dihydroisoquinolin-2-yl)-3,4-dihydroxyoxolan-2-yl]methoxy}(hydroxy)phosphoryl)oxy](hydroxy)phosphoryl}oxy)phosphonic acid | CHEMBL399017
TypeSmall organic molecule
Emp. Form.C14H17FNO14P3
Mol. Mass.535.2028
SMILESO[C@H]1[C@@H](O)[C@@H](O[C@@H]1COP(O)(=O)OP(O)(=O)OP(O)(O)=O)n1ccc2ccc(F)cc2c1=O