Reaction Details
TargetP2Y purinoceptor 2
LigandBDBM50197696
Substrate/Competitorn/a
Meas. Tech.ChEMBL_453274 (CHEMBL902429)
EC50 10±n/a nM
Citation Davenport, RJDiaz, PGalvin, FCLloyd, SMack, SROwens, RSabin, VWynn, J Novel nucleotide triphosphates as potent P2Y2 agonists with enhanced stability over UTP. Bioorg Med Chem Lett17:558-61 (2007) 
 
P2Y purinoceptor 2
Name:P2Y purinoceptor 2
Type:PROTEIN
Mol. Mass.:42299.21
Organism:Homo sapiens (Human)
Description:ChEMBL_1455361
Residue:377
BDBM50197696
NameBDBM50197696
Synonyms:({[({[(2R,3S,4R,5R)-3,4-dihydroxy-5-[5-(trifluoromethyl)-1,3-benzothiazol-2-yl]oxolan-2-yl]methoxy}(hydroxy)phosphoryl)oxy](hydroxy)phosphoryl}oxy)phosphonic acid | CHEMBL391317
TypeSmall organic molecule
Emp. Form.C13H15F3NO13P3S
Mol. Mass.575.239
SMILESO[C@@H]1[C@@H](COP(O)(=O)OP(O)(=O)OP(O)(O)=O)O[C@H]([C@@H]1O)c1nc2cc(ccc2s1)C(F)(F)F