Reaction Details
TargetP2Y purinoceptor 2
LigandBDBM50118213
Substrate/Competitorn/a
Meas. Tech.ChEMBL_453274 (CHEMBL902429)
EC50 7±n/a nM
Citation Davenport, RJDiaz, PGalvin, FCLloyd, SMack, SROwens, RSabin, VWynn, J Novel nucleotide triphosphates as potent P2Y2 agonists with enhanced stability over UTP. Bioorg Med Chem Lett17:558-61 (2007) 
 
P2Y purinoceptor 2
Name:P2Y purinoceptor 2
Type:PROTEIN
Mol. Mass.:42299.21
Organism:Homo sapiens (Human)
Description:ChEMBL_1455361
Residue:377
BDBM50118213
NameBDBM50118213
Synonyms:5'-UTP H4utp uridine 5'-(tetrahydrogen triphosphate) | uridine 5'-triphosphoric acid
TypeSmall organic molecule
Emp. Form.C9H15N2O15P3
Mol. Mass.484.1411
SMILESO[C@@H]1[C@@H](COP(O)(=O)OP(O)(=O)OP(O)(O)=O)O[C@H]([C@@H]1O)n1ccc(=O)[nH]c1=O