Reaction Details
TargetD(2) dopamine receptor
LigandBDBM50205791
Substrate/Competitorn/a
Meas. Tech.ChEMBL_454646 (CHEMBL886666)
Ki>1000±n/a nM
Citation Wilson, KJvan Niel, MBCooper, LBloomfield, DO'Connor, DFish, LRMacLeod, AM 2,5-Disubstituted pyridines: the discovery of a novel series of 5-HT2A ligands. Bioorg Med Chem Lett17:2643-8 (2007) 
 
D(2) dopamine receptor
Name:D(2) dopamine receptor
Type:Cell-surface receptors
Mol. Mass.:50647.10
Organism:Homo sapiens (Human)
Description:P14416
Residue:443
BDBM50205791
NameBDBM50205791
Synonyms:(E)-2-(4-fluorostyryl)-5-(2-fluorophenylsulfonyl)pyridine | CHEMBL240454
TypeSmall organic molecule
Emp. Form.C19H13F2NO2S
Mol. Mass.357.374
SMILESFc1ccc(\C=C\c2ccc(cn2)S(=O)(=O)c2ccccc2F)cc1