Reaction Details
Target5-hydroxytryptamine receptor 2A
LigandBDBM50205801
Substrate/Competitorn/a
Meas. Tech.ChEMBL_454643 (CHEMBL886663)
Ki 1.8±n/a nM
Citation Wilson, KJvan Niel, MBCooper, LBloomfield, DO'Connor, DFish, LRMacLeod, AM 2,5-Disubstituted pyridines: the discovery of a novel series of 5-HT2A ligands. Bioorg Med Chem Lett17:2643-8 (2007) 
 
5-hydroxytryptamine receptor 2A
Name:5-hydroxytryptamine receptor 2A
Type:undefined
Mol. Mass.:52607.65
Organism:Homo sapiens (Human)
Description:P28223
Residue:471
BDBM50205801
NameBDBM50205801
Synonyms:(E)-2-(2-chloro-4-fluorostyryl)-5-(2-fluorophenylsulfonyl)pyridine | CHEMBL397112
TypeSmall organic molecule
Emp. Form.C19H12ClF2NO2S
Mol. Mass.391.819
SMILESFc1ccc(\C=C\c2ccc(cn2)S(=O)(=O)c2ccccc2F)c(Cl)c1