Reaction Details
Target5-hydroxytryptamine receptor 2A
LigandBDBM50205783
Substrate/Competitorn/a
Meas. Tech.ChEMBL_454643 (CHEMBL886663)
Ki 3.5±n/a nM
Citation Wilson, KJvan Niel, MBCooper, LBloomfield, DO'Connor, DFish, LRMacLeod, AM 2,5-Disubstituted pyridines: the discovery of a novel series of 5-HT2A ligands. Bioorg Med Chem Lett17:2643-8 (2007) 
 
5-hydroxytryptamine receptor 2A
Name:5-hydroxytryptamine receptor 2A
Type:undefined
Mol. Mass.:52607.65
Organism:Homo sapiens (Human)
Description:P28223
Residue:471
BDBM50205783
NameBDBM50205783
Synonyms:(E)-2-(2,4-difluorostyryl)-5-(2-fluorophenylsulfinyl)pyridine | CHEMBL238760
TypeSmall organic molecule
Emp. Form.C19H12F3NOS
Mol. Mass.359.365
SMILESFc1ccc(\C=C\c2ccc(cn2)S(=O)c2ccccc2F)c(F)c1