Reaction Details
TargetSphingosine 1-phosphate receptor 1
LigandBDBM50208889
Substrate/Competitorn/a
Meas. Tech.ChEMBL_455175 (CHEMBL887205)
IC50 80±n/a nM
Citation Nakamura, TYonesu, KMizuno, YSuzuki, CSakata, YTakuwa, YNara, FSatoh, S Synthesis and SAR studies of a novel class of S1P1 receptor antagonists. Bioorg Med Chem15:3548-64 (2007) 
 
Sphingosine 1-phosphate receptor 1
Name:Sphingosine 1-phosphate receptor 1
Type:Enzyme
Mol. Mass.:42836.02
Organism:Homo sapiens (Human)
Description:P21453
Residue:382
BDBM50208889
NameBDBM50208889
Synonyms:sodium 4-[(4-butoxyphenyl)thio]-20-(1,12-dihydroxydodec-2-yn-1-yl)biphenyl-3-sulfonate
TypeSmall organic molecule
Emp. Form.C35H43O6S2
Mol. Mass.623.843
SMILESCCCCOc1ccc(Sc2ccc(cc2S([O-])(=O)=O)-c2ccccc2C(O)C#CCCCCCCCCCCO)cc1