Reaction Details
TargetSphingosine 1-phosphate receptor 2
LigandBDBM50208887
Substrate/Competitorn/a
Meas. Tech.ChEMBL_455177 (CHEMBL887207)
IC50 24000±n/a nM
Citation Nakamura, TYonesu, KMizuno, YSuzuki, CSakata, YTakuwa, YNara, FSatoh, S Synthesis and SAR studies of a novel class of S1P1 receptor antagonists. Bioorg Med Chem15:3548-64 (2007) 
 
Sphingosine 1-phosphate receptor 2
Name:Sphingosine 1-phosphate receptor 2
Type:G Protein-Coupled Receptor (GPCR)
Mol. Mass.:38883.16
Organism:Homo sapiens (Human)
Description:Membranes isolated from S1P2-transfected CHO cells were used in ligand binding assay.
Residue:353
BDBM50208887
NameBDBM50208887
Synonyms:CHEMBL239659 | sodium 4-[(4-butoxyphenyl)thio]-20-(1-hydroxytridec-2-yn-1-yl)biphenyl-3-sulfonate
TypeSmall organic molecule
Emp. Form.C35H43O5S2
Mol. Mass.607.843
SMILESCCCCCCCCCCC#CC(O)c1ccccc1-c1ccc(Sc2ccc(OCCCC)cc2)c(c1)S([O-])(=O)=O