Reaction Details
TargetSphingosine 1-phosphate receptor 1
LigandBDBM50208901
Substrate/Competitorn/a
Meas. Tech.ChEMBL_455175 (CHEMBL887205)
IC50 98±n/a nM
Citation Nakamura, TYonesu, KMizuno, YSuzuki, CSakata, YTakuwa, YNara, FSatoh, S Synthesis and SAR studies of a novel class of S1P1 receptor antagonists. Bioorg Med Chem15:3548-64 (2007) 
 
Sphingosine 1-phosphate receptor 1
Name:Sphingosine 1-phosphate receptor 1
Type:Enzyme
Mol. Mass.:42836.02
Organism:Homo sapiens (Human)
Description:P21453
Residue:382
BDBM50208901
NameBDBM50208901
Synonyms:CHEMBL239876 | sodium 4-[(4-butoxyphenyl)thio]-20-[1-hydroxy-4-[(5-hydroxynonyl)oxy]but-2-yn-1-yl]biphenyl-3-sulfonate
TypeSmall organic molecule
Emp. Form.C35H43O7S2
Mol. Mass.639.842
SMILESCCCCOc1ccc(Sc2ccc(cc2S([O-])(=O)=O)-c2ccccc2C(O)C#CCOCCCCCCCCCO)cc1