Reaction Details
TargetEstrogen receptor beta
LigandBDBM50211101
Substrate/Competitorn/a
Meas. Tech.ChEMBL_455543 (CHEMBL886322)
IC50 782±n/a nM
Citation Blizzard, TAGude, CChan, WBirzin, ETMojena, MTudela, CChen, FKnecht, KSu, QKraker, BHolmes, MARohrer, SPHammond, ML Bridged androstenediol analogs as ER-beta selective SERMs. Bioorg Med Chem Lett17:2944-8 (2007) 
 
Estrogen receptor beta
Name:Estrogen receptor beta
Type:Protein
Mol. Mass.:59238.43
Organism:Homo sapiens (Human)
Description:Q92731
Residue:530
BDBM50211101
NameBDBM50211101
Synonyms:(8R,9S,10S,13S,14S,17S)-17-hydroxy-13-methyl-10-vinyl-1,7,8,10,11,12,13,15,16,17-decahydro-2H-cyclopenta[a]phenanthren-3(6H,9H,14H)-one | CHEMBL246140
TypeSmall organic molecule
Emp. Form.C20H28O2
Mol. Mass.300.4351
SMILESC[C@]12CC[C@H]3[C@@H](CCC4=CC(=O)CC[C@]34C=C)[C@@H]1CC[C@@H]2O