Reaction Details
TargetAndrogen receptor
LigandBDBM50211100
Substrate/Competitorn/a
Meas. Tech.ChEMBL_455548 (CHEMBL886327)
IC50 88±n/a nM
Citation Blizzard, TAGude, CChan, WBirzin, ETMojena, MTudela, CChen, FKnecht, KSu, QKraker, BHolmes, MARohrer, SPHammond, ML Bridged androstenediol analogs as ER-beta selective SERMs. Bioorg Med Chem Lett17:2944-8 (2007) 
 
Androgen receptor
Name:Androgen receptor
Type:Receptor
Mol. Mass.:99185.27
Organism:Homo sapiens (Human)
Description:CHO cells were stably transfected with human AR gene.
Residue:920
BDBM50211100
NameBDBM50211100
Synonyms:(3S,8R,9S,10R,13S,14S,17S)-10-ethyl-13-methyl-2,3,4,7,8,9,10,11,12,13,14,15,16,17-tetradecahydro-1H-cyclopenta[a]phenanthrene-3,17-diol | CHEMBL391795
TypeSmall organic molecule
Emp. Form.C20H32O2
Mol. Mass.304.4669
SMILESCC[C@]12CC[C@H](O)CC1=CC[C@H]1[C@@H]3CC[C@H](O)[C@@]3(C)CC[C@H]21