Reaction Details
TargetEstrogen receptor beta
LigandBDBM50211113
Substrate/Competitorn/a
Meas. Tech.ChEMBL_455543 (CHEMBL886322)
IC50 1460±n/a nM
Citation Blizzard, TAGude, CChan, WBirzin, ETMojena, MTudela, CChen, FKnecht, KSu, QKraker, BHolmes, MARohrer, SPHammond, ML Bridged androstenediol analogs as ER-beta selective SERMs. Bioorg Med Chem Lett17:2944-8 (2007) 
 
Estrogen receptor beta
Name:Estrogen receptor beta
Type:Protein
Mol. Mass.:59238.43
Organism:Homo sapiens (Human)
Description:Q92731
Residue:530
BDBM50211113
NameBDBM50211113
Synonyms:(1R,2S,5S,6S,9S,10R,14R)-6-hydroxy-5-methylpentacyclo[12.3.2.0^{1,13}.0^{2,10}.0^{5,9}]nonadec-12-en-15-one | CHEMBL397344
TypeSmall organic molecule
Emp. Form.C20H28O2
Mol. Mass.300.4351
SMILESC[C@]12CC[C@H]3[C@@H](CC=C4[C@H]5CC[C@@]34CCC5=O)[C@@H]1CC[C@@H]2O