Reaction Details
TargetAndrogen receptor
LigandBDBM50211102
Substrate/Competitorn/a
Meas. Tech.ChEMBL_455548 (CHEMBL886327)
IC50 85±n/a nM
Citation Blizzard, TAGude, CChan, WBirzin, ETMojena, MTudela, CChen, FKnecht, KSu, QKraker, BHolmes, MARohrer, SPHammond, ML Bridged androstenediol analogs as ER-beta selective SERMs. Bioorg Med Chem Lett17:2944-8 (2007) 
 
Androgen receptor
Name:Androgen receptor
Type:Receptor
Mol. Mass.:99185.27
Organism:Homo sapiens (Human)
Description:CHO cells were stably transfected with human AR gene.
Residue:920
BDBM50211102
NameBDBM50211102
Synonyms:(1S,2S,5S,6S,9S,10R,14R,15S)-5-methylpentacyclo[12.3.3.0^{1,13}.0^{2,10}.0^{5,9}]icosa-12,18-diene-6,15-diol | CHEMBL246341
TypeSmall organic molecule
Emp. Form.C21H30O2
Mol. Mass.314.4617
SMILESC[C@]12CC[C@H]3[C@@H](CC=C4[C@H]5CC=C[C@@]34CC[C@@H]5O)[C@@H]1CC[C@@H]2O