Reaction Details
TargetMuscarinic acetylcholine receptor M3
LigandBDBM50218058
Substrate/Competitorn/a
Meas. Tech.ChEMBL_457002 (CHEMBL923345)
Ki 20±n/a nM
Citation Kumar, NKaur, KAeron, SDharmarajan, SSilamkoti, ADMehta, AGupta, SChugh, AGupta, JBSalman, MPalle, VPCliffe, IA Synthesis and optimization of novel and selective muscarinic M(3) receptor antagonists. Bioorg Med Chem Lett17:5256-60 (2007) 
 
Muscarinic acetylcholine receptor M3
Name:Muscarinic acetylcholine receptor M3
Type:Enzyme Catalytic Domain
Mol. Mass.:66086.66
Organism:RAT
Description:Cholinergic, muscarinic M3 CHRM3 RAT::P08483
Residue:589
BDBM50218058
NameBDBM50218058
Synonyms:(R)-N-((1S,5R,6s)-3-(2-(benzo[d][1,3]dioxol-5-yl)ethyl)-3-aza-bicyclo[3.1.0]hexan-6-yl)-2-cyclopentyl-2-hydroxy-2-phenylacetamide | CHEMBL249205
TypeSmall organic molecule
Emp. Form.C27H32N2O4
Mol. Mass.448.554
SMILESOC(C1CCCC1)(C(=O)N[C@@H]1[C@H]2CN(CCc3ccc4OCOc4c3)C[C@@H]12)c1ccccc1