Reaction Details
TargetDelta-type opioid receptor
LigandBDBM50218792
Substrate/Competitorn/a
Meas. Tech.ChEMBL_457105 (CHEMBL924481)
Ki 19±n/a nM
Citation Smith, TAThatcher, LNCoop, A 3-Hydroxy-4-methoxyindolomorphinans as delta opioid selective ligands. Bioorg Med Chem Lett17:5175-6 (2007) 
 
Delta-type opioid receptor
Name:Delta-type opioid receptor
Type:G Protein-Coupled Receptor (GPCR)
Mol. Mass.:40465.04
Organism:Rattus norvegicus (rat)
Description:Competition binding assays were using CHO-K1 cell membranes expressing the opioid receptor.
Residue:372
BDBM50218792
NameBDBM50218792
Synonyms:(1R,13S,14R)-24-(cyclopropylmethyl)-19,20-dimethoxy-4,24-diazahexacyclo[12.7.3.0^{1,13}.0^{3,11}.0^{5,10}.0^{16,21}]tetracosa-3(11),5(10),6,8,16,18,20-heptaen-13-ol | CHEMBL400157
TypeSmall organic molecule
Emp. Form.C28H32N2O3
Mol. Mass.444.5653
SMILESCOc1ccc2C[C@H]3N(CC4CC4)CC[C@@]4(Cc5[nH]c6ccccc6c5C[C@@]34O)c2c1OC