Reaction Details
TargetDNA primase TraC
LigandBDBM15236
Substrate/Competitorn/a
Meas. Tech.ChEMBL_457726 (CHEMBL924003)
IC50 700000±n/a nM
Citation Griep, MABlood, SLarson, MAKoepsell, SAHinrichs, SH Myricetin inhibits Escherichia coli DnaB helicase but not primase. Bioorg Med Chem15:7203-8 (2007) 
 
DNA primase TraC
Name:DNA primase TraC
Type:PROTEIN
Mol. Mass.:116706.19
Organism:Escherichia coli
Description:ChEMBL_457726
Residue:1061
BDBM15236
NameBDBM15236
Synonyms:3,5,7-trihydroxy-2-(3,4,5-trihydroxyphenyl)-4H-chromen-4-one CHEMBL164 Myricetin Myricetin (Myr) | cid_5281672
TypeSmall organic molecule
Emp. Form.C15H10O8
Mol. Mass.318.2351
SMILESOc1cc(O)c2c(c1)oc(-c1cc(O)c(O)c(O)c1)c(O)c2=O