Reaction Details
TargetCannabinoid receptor 1
LigandBDBM50222832
Substrate/Competitorn/a
Meas. Tech.ChEMBL_458050 (CHEMBL925388)
IC50 1200±n/a nM
Citation Ohta, HIshizaka, TTatsuzuki, MYoshinaga, MIida, ITomishima, YToda, YSaito, S N-Alkylidenearylcarboxamides as new potent and selective CB(2) cannabinoid receptor agonists with good oral bioavailability. Bioorg Med Chem Lett17:6299-304 (2007) 
 
Cannabinoid receptor 1
Name:Cannabinoid receptor 1
Type:G Protein-Coupled Receptor (GPCR)
Mol. Mass.:52868.96
Organism:Homo sapiens (Human)
Description:P21554
Residue:472
BDBM50222832
NameBDBM50222832
Synonyms:CHEMBL248386 | N-(5-tert-butyl-3-(cyclopropylmethyl)-4-methylthiazol-2(3H)-ylidene)-2-methyl-5-(trifluoromethyl)benzamide
TypeSmall organic molecule
Emp. Form.C21H25F3N2OS
Mol. Mass.410.496
SMILESCc1c(sc(=NC(=O)c2cc(ccc2C)C(F)(F)F)n1CC1CC1)C(C)(C)C