Reaction Details
TargetCannabinoid receptor 2
LigandBDBM50222839
Substrate/Competitorn/a
Meas. Tech.ChEMBL_458051 (CHEMBL925389)
EC50 86±n/a nM
Citation Ohta, HIshizaka, TTatsuzuki, MYoshinaga, MIida, ITomishima, YToda, YSaito, S N-Alkylidenearylcarboxamides as new potent and selective CB(2) cannabinoid receptor agonists with good oral bioavailability. Bioorg Med Chem Lett17:6299-304 (2007) 
 
Cannabinoid receptor 2
Name:Cannabinoid receptor 2
Type:G Protein-Coupled Receptor (GPCR)
Mol. Mass.:39690.94
Organism:Homo sapiens (Human)
Description:P34972
Residue:360
BDBM50222839
NameBDBM50222839
Synonyms:CHEMBL395704 | N-(5-tert-butyl-3-(cyclopropylmethyl)-4-methylthiazol-2(3H)-ylidene)benzamide
TypeSmall organic molecule
Emp. Form.C19H24N2OS
Mol. Mass.328.472
SMILESCc1c(s\c(=N/C(=O)c2ccccc2)n1CC1CC1)C(C)(C)C