Reaction Details
TargetCannabinoid receptor 2
LigandBDBM50222842
Substrate/Competitorn/a
Meas. Tech.ChEMBL_458048 (CHEMBL925386)
IC50 20±n/a nM
Citation Ohta, HIshizaka, TTatsuzuki, MYoshinaga, MIida, ITomishima, YToda, YSaito, S N-Alkylidenearylcarboxamides as new potent and selective CB(2) cannabinoid receptor agonists with good oral bioavailability. Bioorg Med Chem Lett17:6299-304 (2007) 
 
Cannabinoid receptor 2
Name:Cannabinoid receptor 2
Type:G Protein-Coupled Receptor (GPCR)
Mol. Mass.:39690.94
Organism:Homo sapiens (Human)
Description:P34972
Residue:360
BDBM50222842
NameBDBM50222842
Synonyms:CHEMBL247817 | N-(5-tert-butyl-3-(cyclopropylmethyl)-4-methylthiazol-2(3H)-ylidene)-3-chlorobenzamide
TypeSmall organic molecule
Emp. Form.C19H23ClN2OS
Mol. Mass.362.917
SMILESCc1c(s\c(=N/C(=O)c2cccc(Cl)c2)n1CC1CC1)C(C)(C)C