Reaction Details
TargetCannabinoid receptor 1
LigandBDBM50222830
Substrate/Competitorn/a
Meas. Tech.ChEMBL_458050 (CHEMBL925388)
IC50 4100±n/a nM
Citation Ohta, HIshizaka, TTatsuzuki, MYoshinaga, MIida, ITomishima, YToda, YSaito, S N-Alkylidenearylcarboxamides as new potent and selective CB(2) cannabinoid receptor agonists with good oral bioavailability. Bioorg Med Chem Lett17:6299-304 (2007) 
 
Cannabinoid receptor 1
Name:Cannabinoid receptor 1
Type:G Protein-Coupled Receptor (GPCR)
Mol. Mass.:52868.96
Organism:Homo sapiens (Human)
Description:P21554
Residue:472
BDBM50222830
NameBDBM50222830
Synonyms:CHEMBL248014 | N-(5-tert-butyl-3-(2-methoxyethyl)-4-methylthiazol-2(3H)-ylidene)-3-(trifluoromethyl)benzamide
TypeSmall organic molecule
Emp. Form.C19H23F3N2O2S
Mol. Mass.400.458
SMILESCOCCn1c(C)c(s\c1=N/C(=O)c1cccc(c1)C(F)(F)F)C(C)(C)C