Reaction Details
TargetCannabinoid receptor 2
LigandBDBM50222851
Substrate/Competitorn/a
Meas. Tech.ChEMBL_458048 (CHEMBL925386)
IC50 29±n/a nM
Citation Ohta, HIshizaka, TTatsuzuki, MYoshinaga, MIida, ITomishima, YToda, YSaito, S N-Alkylidenearylcarboxamides as new potent and selective CB(2) cannabinoid receptor agonists with good oral bioavailability. Bioorg Med Chem Lett17:6299-304 (2007) 
 
Cannabinoid receptor 2
Name:Cannabinoid receptor 2
Type:G Protein-Coupled Receptor (GPCR)
Mol. Mass.:39690.94
Organism:Homo sapiens (Human)
Description:P34972
Residue:360
BDBM50222851
NameBDBM50222851
Synonyms:CHEMBL400931 | N-(3-(cyclopropylmethyl)-5-isopropyl-4-methylthiazol-2(3H)-ylidene)-3-(trifluoromethyl)benzamide
TypeSmall organic molecule
Emp. Form.C19H21F3N2OS
Mol. Mass.382.443
SMILESCC(C)c1s\c(=N/C(=O)c2cccc(c2)C(F)(F)F)n(CC2CC2)c1C