Reaction Details
TargetEstrogen receptor
LigandBDBM50223229
Substrate/Competitorn/a
Meas. Tech.ChEMBL_458136 (CHEMBL925469)
EC50 540±n/a nM
Citation Blizzard, TAGude, CMorgan, JDChan, WBirzin, ETMojena, MTudela, CChen, FKnecht, KSu, QKraker, BMosley, RTHolmes, MARohrer, SPHammond, ML Androstene-3,5-dienes as ER-beta selective SERMs. Bioorg Med Chem Lett17:6295-8 (2007) 
 
Estrogen receptor
Name:Estrogen receptor
Type:Protein
Mol. Mass.:66230.44
Organism:Homo sapiens (Human)
Description:P03372
Residue:595
BDBM50223229
NameBDBM50223229
Synonyms:(8R,9S,10R,13S,14S,17S)-3,10,13-trimethyl-2,7,8,9,10,11,12,13,14,15,16,17-dodecahydro-1H-cyclopenta[a]phenanthren-17-ol | CHEMBL250110
TypeSmall organic molecule
Emp. Form.C20H30O
Mol. Mass.286.4516
SMILESCC1=CC2=CC[C@H]3[C@@H]4CC[C@H](O)[C@@]4(C)CC[C@@H]3[C@@]2(C)CC1