Reaction Details
TargetDelta-type opioid receptor
LigandBDBM50097579
Substrate/Competitorn/a
Meas. Tech.ChEMBL_458379 (CHEMBL941713)
Ki 5.2±n/a nM
Citation VanAlstine, MAWentland, MPCohen, DJBidlack, JM Redefining the structure-activity relationships of 2,6-methano-3-benzazocines. 5. Opioid receptor binding properties of N-((4'-phenyl)-phenethyl) analogues of 8-CAC. Bioorg Med Chem Lett17:6516-20 (2007) 
 
Delta-type opioid receptor
Name:Delta-type opioid receptor
Type:G Protein-Coupled Receptor (GPCR)
Mol. Mass.:40382.98
Organism:Homo sapiens (Human)
Description:Competition binding assays were carried out using membrane preparations from transfected HN9.10 cells that constitutively expressed the delta opioid receptor.
Residue:372
BDBM50097579
NameBDBM50097579
Synonyms:(6S,11R)-3-Cyclopropylmethyl-6,11-dimethyl-1,2,3,4,5,6-hexahydro-2,6-methano-benzo[d]azocine-8-carboxylic acid amide 8-carboxamidocyclazocine US9656961, Example 00157
TypeSmall organic molecule
Emp. Form.C19H26N2O
Mol. Mass.298.4225
SMILESC[C@H]1C2Cc3ccc(cc3[C@@]1(C)CCN2CC1CC1)C(N)=O