Reaction Details
TargetMu-type opioid receptor
LigandBDBM50224871
Substrate/Competitorn/a
Meas. Tech.ChEMBL_458378 (CHEMBL941712)
Ki 1.9±n/a nM
Citation VanAlstine, MAWentland, MPCohen, DJBidlack, JM Redefining the structure-activity relationships of 2,6-methano-3-benzazocines. 5. Opioid receptor binding properties of N-((4'-phenyl)-phenethyl) analogues of 8-CAC. Bioorg Med Chem Lett17:6516-20 (2007) 
 
Mu-type opioid receptor
Name:Mu-type opioid receptor
Type:G Protein-Coupled Receptor (GPCR)
Mol. Mass.:44789.51
Organism:Homo sapiens (Human)
Description:P35372
Residue:400
BDBM50224871
NameBDBM50224871
Synonyms:(6S,11R)-3-cyclopropylmethyl-6,11-dimethyl-1,2,3,4,5,6-hexahydro-2,6-methano-benzo[d]azocine-8-carboxylic acid (3-naphthalen-2-yl-propyl)-amide | CHEMBL430397
TypeSmall organic molecule
Emp. Form.C32H38N2O
Mol. Mass.466.6569
SMILESC[C@H]1C2Cc3ccc(cc3[C@@]1(C)CCN2CC1CC1)C(=O)NCCCc1ccc2ccccc2c1