Reaction Details
TargetSerine/threonine-protein kinase Chk1
LigandBDBM50224907
Substrate/Competitorn/a
Meas. Tech.ChEMBL_458388 (CHEMBL942709)
IC50 1±n/a nM
Citation Tao, ZFChen, ZBui, MHKovar, PJohnson, EBouska, JZhang, HRosenberg, SSowin, TLin, NH Macrocyclic ureas as potent and selective Chk1 inhibitors: an improved synthesis, kinome profiling, structure-activity relationships, and preliminary pharmacokinetics. Bioorg Med Chem Lett17:6593-601 (2007) 
 
Serine/threonine-protein kinase Chk1
Name:Serine/threonine-protein kinase Chk1
Type:Enzyme Catalytic Domain
Mol. Mass.:54443.02
Organism:Homo sapiens (Human)
Description:gi_166295192
Residue:476
BDBM50224907
NameBDBM50224907
Synonyms:CHEMBL248554 | [1,4']pipiperidinyl-1'-carboxylic acid (Z)-7-chloro-18-cyano-3-oxo-11,16-dioxa-2,4,19,21-tetraaza-tricyclo[15.3.1.0*5,10*]henicosa-1(21),5,7,9,13,17,19-heptaen-8-yl ester
TypeSmall organic molecule
Emp. Form.C27H30ClN7O5
Mol. Mass.568.024
SMILESClc1cc2NC(=O)Nc3cnc(C#N)c(OC\C=C/COc2cc1OC(=O)N1CCC(CC1)N1CCCCC1)n3