Reaction Details
TargetSerine/threonine-protein kinase Chk1
LigandBDBM50224890
Substrate/Competitorn/a
Meas. Tech.ChEMBL_458388 (CHEMBL942709)
IC50 6±n/a nM
Citation Tao, ZFChen, ZBui, MHKovar, PJohnson, EBouska, JZhang, HRosenberg, SSowin, TLin, NH Macrocyclic ureas as potent and selective Chk1 inhibitors: an improved synthesis, kinome profiling, structure-activity relationships, and preliminary pharmacokinetics. Bioorg Med Chem Lett17:6593-601 (2007) 
 
Serine/threonine-protein kinase Chk1
Name:Serine/threonine-protein kinase Chk1
Type:Enzyme Catalytic Domain
Mol. Mass.:54443.02
Organism:Homo sapiens (Human)
Description:gi_166295192
Residue:476
BDBM50224890
NameBDBM50224890
Synonyms:7-chloro-3-oxo-8-(2-oxo-oxazolidin-3-yl)-11,16-dioxa-2,4,19,21-tetraaza-tricyclo[15.3.1.0*5,10*]henicosa-1(21),5,7,9,17,19-hexaene-18-carbonitrile | CHEMBL248953
TypeSmall organic molecule
Emp. Form.C19H17ClN6O5
Mol. Mass.444.828
SMILESClc1cc2NC(=O)Nc3cnc(C#N)c(OCCCCOc2cc1N1CCOC1=O)n3