Reaction Details
TargetSerine/threonine-protein kinase Chk1
LigandBDBM50224888
Substrate/Competitorn/a
Meas. Tech.ChEMBL_458388 (CHEMBL942709)
IC50 8±n/a nM
Citation Tao, ZFChen, ZBui, MHKovar, PJohnson, EBouska, JZhang, HRosenberg, SSowin, TLin, NH Macrocyclic ureas as potent and selective Chk1 inhibitors: an improved synthesis, kinome profiling, structure-activity relationships, and preliminary pharmacokinetics. Bioorg Med Chem Lett17:6593-601 (2007) 
 
Serine/threonine-protein kinase Chk1
Name:Serine/threonine-protein kinase Chk1
Type:Enzyme Catalytic Domain
Mol. Mass.:54443.02
Organism:Homo sapiens (Human)
Description:gi_166295192
Residue:476
BDBM50224888
NameBDBM50224888
Synonyms:7-chloro-8-(2-hydroxy-ethoxy)-3-oxo-11,16-dioxa-2,4,19,21-tetraaza-tricyclo[15.3.1.0*5,10*]henicosa-1(21),5,7,9,17,19-hexaene-18-carbonitrile | CHEMBL249155
TypeSmall organic molecule
Emp. Form.C18H18ClN5O5
Mol. Mass.419.819
SMILESOCCOc1cc2OCCCCOc3nc(NC(=O)Nc2cc1Cl)cnc3C#N