Reaction Details
TargetMitogen-activated protein kinase 12
LigandBDBM50224883
Substrate/Competitorn/a
Meas. Tech.ChEMBL_458510 (CHEMBL941826)
Ki>7500±n/a nM
Citation Tao, ZFChen, ZBui, MHKovar, PJohnson, EBouska, JZhang, HRosenberg, SSowin, TLin, NH Macrocyclic ureas as potent and selective Chk1 inhibitors: an improved synthesis, kinome profiling, structure-activity relationships, and preliminary pharmacokinetics. Bioorg Med Chem Lett17:6593-601 (2007) 
 
Mitogen-activated protein kinase 12
Name:Mitogen-activated protein kinase 12
Type:Protein
Mol. Mass.:41938.69
Organism:Homo sapiens (Human)
Description:P53778
Residue:367
BDBM50224883
NameBDBM50224883
Synonyms:7-chloro-3-oxo-8-[(thiazol-5-ylmethyl)-amino]-11,16-dioxa-2,4,19,21-tetraaza-tricyclo[15.3.1.0*5,10*]henicosa-1(21),5,7,9,17,19-hexaene-18-crbonitrile | CHEMBL248757
TypeSmall organic molecule
Emp. Form.C20H18ClN7O3S
Mol. Mass.471.92
SMILESClc1cc2NC(=O)Nc3cnc(C#N)c(OCCCCOc2cc1NCc1cncs1)n3