Reaction Details
TargetCarbonic anhydrase 1
LigandBDBM50211828
Substrate/Competitorn/a
Meas. Tech.ChEMBL_459049 (CHEMBL925141)
Ki 180±n/a nM
Citation Supuran, CTScozzafava, A Carbonic anhydrases as targets for medicinal chemistry. Bioorg Med Chem15:4336-50 (2007) 
 
Carbonic anhydrase 1
Name:Carbonic anhydrase 1
Type:Enzyme
Mol. Mass.:28873.37
Organism:Homo sapiens (Human)
Description:P00915
Residue:261
BDBM50211828
NameBDBM50211828
Synonyms:4-(2-(pyridin-4-ylmethyleneamino)ethyl)benzenesulfonamide | CHEMBL253362
TypeSmall organic molecule
Emp. Form.C14H15N3O2S
Mol. Mass.289.353
SMILESNS(=O)(=O)c1ccc(CC\N=C\c2ccncc2)cc1