Reaction Details
TargetCarbonic anhydrase 4
LigandBDBM50211834
Substrate/Competitorn/a
Meas. Tech.ChEMBL_459061 (CHEMBL925153)
Ki 120±n/a nM
Citation Supuran, CTScozzafava, A Carbonic anhydrases as targets for medicinal chemistry. Bioorg Med Chem15:4336-50 (2007) 
 
Carbonic anhydrase 4
Name:Carbonic anhydrase 4
Type:Enzyme
Mol. Mass.:35152.74
Organism:Bos taurus (bovine)
Description:Bovine isozyme, isolated from lung microsomes
Residue:312
BDBM50211834
NameBDBM50211834
Synonyms:2-[(1E)-{[2-(4-sulfamoylphenyl)ethyl]imino}methyl]phenyl N-[(4-methylbenzene)sulfonyl]carbamate | CHEMBL430213
TypeSmall organic molecule
Emp. Form.C23H23N3O6S2
Mol. Mass.501.575
SMILESCc1ccc(cc1)S(=O)(=O)NC(=O)Oc1ccccc1C=NCCc1ccc(cc1)S(N)(=O)=O