Reaction Details
TargetCarbonic anhydrase 2
LigandBDBM50211828
Substrate/Competitorn/a
Meas. Tech.ChEMBL_459050 (CHEMBL925142)
Ki 15±n/a nM
Citation Supuran, CTScozzafava, A Carbonic anhydrases as targets for medicinal chemistry. Bioorg Med Chem15:4336-50 (2007) 
 
Carbonic anhydrase 2
Name:Carbonic anhydrase 2
Type:Enzyme
Mol. Mass.:29250.71
Organism:Homo sapiens (Human)
Description:P00918
Residue:260
BDBM50211828
NameBDBM50211828
Synonyms:4-(2-(pyridin-4-ylmethyleneamino)ethyl)benzenesulfonamide | CHEMBL253362
TypeSmall organic molecule
Emp. Form.C14H15N3O2S
Mol. Mass.289.353
SMILESNS(=O)(=O)c1ccc(CC\N=C\c2ccncc2)cc1