Reaction Details
TargetCarbonic anhydrase 1
LigandBDBM50211835
Substrate/Competitorn/a
Meas. Tech.ChEMBL_459049 (CHEMBL925141)
Ki 1100±n/a nM
Citation Supuran, CTScozzafava, A Carbonic anhydrases as targets for medicinal chemistry. Bioorg Med Chem15:4336-50 (2007) 
 
Carbonic anhydrase 1
Name:Carbonic anhydrase 1
Type:Enzyme
Mol. Mass.:28873.37
Organism:Homo sapiens (Human)
Description:P00915
Residue:261
BDBM50211835
NameBDBM50211835
Synonyms:4-(2-(3-nitrobenzylideneamino)ethyl)benzenesulfonamide | CHEMBL254005
TypeSmall organic molecule
Emp. Form.C15H15N3O4S
Mol. Mass.333.362
SMILESNS(=O)(=O)c1ccc(CC\N=C\c2cccc(c2)[N+]([O-])=O)cc1