Reaction Details
TargetCarbonic anhydrase 1
LigandBDBM50211834
Substrate/Competitorn/a
Meas. Tech.ChEMBL_459049 (CHEMBL925141)
Ki 40±n/a nM
Citation Supuran, CTScozzafava, A Carbonic anhydrases as targets for medicinal chemistry. Bioorg Med Chem15:4336-50 (2007) 
 
Carbonic anhydrase 1
Name:Carbonic anhydrase 1
Type:Enzyme
Mol. Mass.:28873.37
Organism:Homo sapiens (Human)
Description:P00915
Residue:261
BDBM50211834
NameBDBM50211834
Synonyms:2-[(1E)-{[2-(4-sulfamoylphenyl)ethyl]imino}methyl]phenyl N-[(4-methylbenzene)sulfonyl]carbamate | CHEMBL430213
TypeSmall organic molecule
Emp. Form.C23H23N3O6S2
Mol. Mass.501.575
SMILESCc1ccc(cc1)S(=O)(=O)NC(=O)Oc1ccccc1C=NCCc1ccc(cc1)S(N)(=O)=O