Reaction Details
TargetCarbonic anhydrase 2
LigandBDBM50211825
Substrate/Competitorn/a
Meas. Tech.ChEMBL_459050 (CHEMBL925142)
Ki 12±n/a nM
Citation Supuran, CTScozzafava, A Carbonic anhydrases as targets for medicinal chemistry. Bioorg Med Chem15:4336-50 (2007) 
 
Carbonic anhydrase 2
Name:Carbonic anhydrase 2
Type:Enzyme
Mol. Mass.:29250.71
Organism:Homo sapiens (Human)
Description:P00918
Residue:260
BDBM50211825
NameBDBM50211825
Synonyms:4,5-dichloro-6-[({[(4-methylphenyl)sulfonyl]amino}carbonyl)amino]benzene-1,3-disulfonamide | CHEMBL255047
TypeSmall organic molecule
Emp. Form.C14H14Cl2N4O7S3
Mol. Mass.517.385
SMILESCc1ccc(cc1)S(=O)(=O)NC(=O)Nc1c(Cl)c(Cl)c(cc1S(N)(=O)=O)S(N)(=O)=O