Reaction Details
TargetCarbonic anhydrase 13
LigandBDBM10887
Substrate/Competitorn/a
Meas. Tech.ChEMBL_459059 (CHEMBL925151)
Ki 47±n/a nM
Citation Supuran, CTScozzafava, A Carbonic anhydrases as targets for medicinal chemistry. Bioorg Med Chem15:4336-50 (2007) 
 
Carbonic anhydrase 13
Name:Carbonic anhydrase 13
Type:Enzyme
Mol. Mass.:29522.80
Organism:Mus musculus (mouse)
Description:Murine cloned isozyme
Residue:262
BDBM10887
NameBDBM10887
Synonyms:Sulfamate 7 US11535599, Example topiramate | [(1R,2S,6S,9R)-4,4,11,11-tetramethyl-3,5,7,10,12-pentaoxatricyclo[7.3.0.0^{2,6}]dodecan-6-yl]methyl sulfamate
TypeSmall organic molecule
Emp. Form.C12H21NO8S
Mol. Mass.339.362
SMILESCC1(C)O[C@@H]2CO[C@@]3(COS(N)(=O)=O)OC(C)(C)O[C@H]3[C@@H]2O1