Reaction Details
TargetCarbonic anhydrase 1
LigandBDBM50211829
Substrate/Competitorn/a
Meas. Tech.ChEMBL_459049 (CHEMBL925141)
Ki 200±n/a nM
Citation Supuran, CTScozzafava, A Carbonic anhydrases as targets for medicinal chemistry. Bioorg Med Chem15:4336-50 (2007) 
 
Carbonic anhydrase 1
Name:Carbonic anhydrase 1
Type:Enzyme
Mol. Mass.:28873.37
Organism:Homo sapiens (Human)
Description:P00915
Residue:261
BDBM50211829
NameBDBM50211829
Synonyms:4-(((1-methyl-1H-pyrrol-2-yl)methyleneamino)methyl)benzenesulfonamide | CHEMBL400889
TypeSmall organic molecule
Emp. Form.C13H15N3O2S
Mol. Mass.277.342
SMILESCn1cccc1\C=N\Cc1ccc(cc1)S(N)(=O)=O