Reaction Details
TargetPancreatic triacylglycerol lipase
LigandBDBM50213694
Substrate/Competitorn/a
Meas. Tech.ChEMBL_459067 (CHEMBL925170)
IC50 270000±n/a nM
Citation Jain, KSKathiravan, MKSomani, RSShishoo, CJ The biology and chemistry of hyperlipidemia. Bioorg Med Chem15:4674-99 (2007) 
 
Pancreatic triacylglycerol lipase
Name:Pancreatic triacylglycerol lipase
Type:PROTEIN
Mol. Mass.:51157.75
Organism:Homo sapiens (Human)
Description:ChEMBL_527250
Residue:465
BDBM50213694
NameBDBM50213694
Synonyms:(R)-2-((2E,8E)-deca-2,8-dienoylamino)-3-((R)-5-hydroxy-6-oxo-3,8-dioxa-tricyclo[5.1.0.0*2,4*]oct-5-yl)-propionic acid methyl ester | CHEMBL253780
TypeSmall organic molecule
Emp. Form.C20H27NO7
Mol. Mass.393.4309
SMILESCOC(=O)[C@@H](C[C@@]1(O)C2OC2C2OC2C1=O)NC(=O)\C=C\CCCC\C=C\C