Reaction Details
TargetCytochrome P450 1B1
LigandBDBM23415
Substrate/Competitorn/a
Meas. Tech.ChEMBL_459098 (CHEMBL926266)
IC50 7±n/a nM
Citation Bruno, RDNjar, VC Targeting cytochrome P450 enzymes: a new approach in anti-cancer drug development. Bioorg Med Chem15:5047-60 (2007) 
 
Cytochrome P450 1B1
Name:Cytochrome P450 1B1
Type:PROTEIN
Mol. Mass.:60861.81
Organism:Homo sapiens (Human)
Description:ChEMBL_1474523
Residue:543
BDBM23415
NameBDBM23415
Synonyms:5,7-dihydroxy-2-(4-methoxyphenyl)-4H-chromen-4-one CHEMBL243664
Typeflavone
Emp. Form.C16H12O5
Mol. Mass.284.2635
SMILESCOc1ccc(cc1)-c1cc(=O)c2c(O)cc(O)cc2o1