Reaction Details
TargetPeroxisome proliferator-activated receptor alpha
LigandBDBM50371235
Substrate/Competitorn/a
Meas. Tech.ChEMBL_459972 (CHEMBL943100)
EC50>10000±n/a nM
Citation Matthews, JMChen, XCryan, EHlasta, DJRybczynski, PJStrauss, KTang, YXu, JZYang, MZhou, LDemarest, KT Design and synthesis of indane-ureido-thioisobutyric acids: A novel class of PPARalpha agonists. Bioorg Med Chem Lett17:6773-8 (2008) 
 
Peroxisome proliferator-activated receptor alpha
Name:Peroxisome proliferator-activated receptor alpha
Type:PROTEIN
Mol. Mass.:52374.28
Organism:Rattus norvegicus
Description:ChEMBL_834194
Residue:468
BDBM50371235
NameBDBM50371235
Synonyms:CIPROFIBRATE
TypeSmall organic molecule
Emp. Form.C13H14Cl2O3
Mol. Mass.289.154
SMILESCC(C)(Oc1ccc(cc1)C1CC1(Cl)Cl)C(O)=O