Reaction Details
TargetMu-type opioid receptor
LigandBDBM21015
Substrate/Competitorn/a
Meas. Tech.ChEMBL_460091 (CHEMBL924967)
IC50 75.55±n/a nM
Citation Tömböly, CBallet, SFeytens, DKövér, KEBorics, ALovas, SAl-Khrasani, MFürst, ZTóth, GBenyhe, STourwé, D Endomorphin-2 with a beta-turn backbone constraint retains the potent micro-opioid receptor agonist properties. J Med Chem51:173-7 (2008) 
 
Mu-type opioid receptor
Name:Mu-type opioid receptor
Type:Enzyme Catalytic Domain
Mol. Mass.:44431.62
Organism:MOUSE
Description:OPIATE Mu OPRM1 MOUSE::P42866
Residue:398
BDBM21015
NameBDBM21015
Synonyms:(2S)-2-{2-[(2R)-2-[(2S)-2-amino-3-(4-hydroxyphenyl)propanamido]propanamido]-N-methylacetamido}-N-(2-hydroxyethyl)-3-phenylpropanamide CHEMBL38874 DAMGO US11492374, ID 2 [tyrosyl-3,5-3H(N)]-D-Ala2-Mephe4-glyol5-enkephalin
TypeAnalgesics
Emp. Form.C26H35N5O6
Mol. Mass.513.586
SMILESC[C@@H](NC(=O)[C@@H](N)Cc1ccc(O)cc1)C(=O)NCC(=O)N(C)[C@@H](Cc1ccccc1)C(=O)NCCO