Reaction Details
TargetAdenosine receptor A1
LigandBDBM50224760
Substrate/Competitorn/a
Meas. Tech.ChEMBL_461289 (CHEMBL927309)
Ki 1118±n/a nM
Citation Cappellacci, LFranchetti, PVita, PPetrelli, RLavecchia, ACosta, BSpinetti, FMartini, CKlotz, KNGrifantini, M 5'-Carbamoyl derivatives of 2'-C-methyl-purine nucleosides as selective A1 adenosine receptor agonists: affinity, efficacy, and selectivity for A1 receptor from different species. Bioorg Med Chem16:336-53 (2008) 
 
Adenosine receptor A1
Name:Adenosine receptor A1
Type:G Protein-Coupled Receptor (GPCR)
Mol. Mass.:36520.92
Organism:Homo sapiens (Human)
Description:P30542
Residue:326
BDBM50224760
NameBDBM50224760
Synonyms:2-chloro-N6-cyclopentyl-9H-(2-C-methyl-5-Nmethylcarbamoyl-beta-D-ribofuranosyl)adenine | CHEMBL254064
TypeSmall organic molecule
Emp. Form.C18H25ClN6O5
Mol. Mass.440.881
SMILESCNC(=O)OC[C@H]1O[C@@H](n2cnc3c(NC4CCCC4)nc(Cl)nc23)[C@](C)(O)[C@@H]1O