Reaction Details
TargetAdenosine receptor A1
LigandBDBM25400
Substrate/Competitorn/a
Meas. Tech.ChEMBL_461281 (CHEMBL927305)
Ki 0.4±n/a nM
Citation Cappellacci, LFranchetti, PVita, PPetrelli, RLavecchia, ACosta, BSpinetti, FMartini, CKlotz, KNGrifantini, M 5'-Carbamoyl derivatives of 2'-C-methyl-purine nucleosides as selective A1 adenosine receptor agonists: affinity, efficacy, and selectivity for A1 receptor from different species. Bioorg Med Chem16:336-53 (2008) 
 
Adenosine receptor A1
Name:Adenosine receptor A1
Type:Enzyme Catalytic Domain
Mol. Mass.:36602.99
Organism:BOVINE
Description:ADENOSINE 0 BOVINE::P28190
Residue:326
BDBM25400
NameBDBM25400
Synonyms:(2R,3R,4S,5R)-2-[6-(cyclopentylamino)-9H-purin-9-yl]-5-(hydroxymethyl)oxolane-3,4-diol CPA N6-cyclopentyladenosine (CPA) | cid_657378
TypeSmall organic molecule
Emp. Form.C15H21N5O4
Mol. Mass.335.3583
SMILESOC[C@H]1O[C@H]([C@H](O)[C@@H]1O)n1cnc2c(NC3CCCC3)ncnc12