Reaction Details
TargetAdenosine receptor A3
LigandBDBM50224775
Substrate/Competitorn/a
Meas. Tech.ChEMBL_461291 (CHEMBL927310)
Ki 26800±n/a nM
Citation Cappellacci, LFranchetti, PVita, PPetrelli, RLavecchia, ACosta, BSpinetti, FMartini, CKlotz, KNGrifantini, M 5'-Carbamoyl derivatives of 2'-C-methyl-purine nucleosides as selective A1 adenosine receptor agonists: affinity, efficacy, and selectivity for A1 receptor from different species. Bioorg Med Chem16:336-53 (2008) 
 
Adenosine receptor A3
Name:Adenosine receptor A3
Type:G Protein-Coupled Receptor (GPCR)
Mol. Mass.:36197.32
Organism:Homo sapiens (Human)
Description:P0DMS8
Residue:318
BDBM50224775
NameBDBM50224775
Synonyms:(2R,3R,4R,5R)-2-(6-(cyclopentylamino)-9H-purin-9-yl)-5-(hydroxymethyl)-3-methyl-tetrahydrofuran-3,4-diol | CHEMBL400189
TypeSmall organic molecule
Emp. Form.C16H23N5O4
Mol. Mass.349.3849
SMILESC[C@@]1(O)[C@H](O)[C@@H](CO)O[C@H]1n1cnc2c(NC3CCCC3)ncnc12