Reaction Details
TargetAcetylcholinesterase
LigandBDBM50158582
Substrate/Competitorn/a
Meas. Tech.ChEMBL_462117 (CHEMBL945890)
IC50 1.6±n/a nM
Citation Cavalli, ABolognesi, MLMinarini, ARosini, MTumiatti, VRecanatini, MMelchiorre, C Multi-target-directed ligands to combat neurodegenerative diseases. J Med Chem51:347-72 (2008) 
 
Acetylcholinesterase
Name:Acetylcholinesterase
Type:Enzyme
Mol. Mass.:67792.70
Organism:Homo sapiens (Human)
Description:P22303
Residue:614
BDBM50158582
NameBDBM50158582
Synonyms:3,8-Diamino-6-phenyl-5-(3-{3-[3-(1,2,3,4-tetrahydro-acridin-9-ylamino)-propylamino]-propylamino}-propyl)-phenanthridinium CHEMBL179455
TypeSmall organic molecule
Emp. Form.C41H48N7
Mol. Mass.638.8662
SMILESNc1ccc2c(c1)c(-c1ccccc1)n(CCCNCCCNCCCNc1c3CCCCc3nc3ccccc13)c1cc(=[NH2+])ccc21