Reaction Details
TargetAcetylcholinesterase
LigandBDBM50110300
Substrate/Competitorn/a
Meas. Tech.ChEMBL_462117 (CHEMBL945890)
IC50 2.6±n/a nM
Citation Cavalli, ABolognesi, MLMinarini, ARosini, MTumiatti, VRecanatini, MMelchiorre, C Multi-target-directed ligands to combat neurodegenerative diseases. J Med Chem51:347-72 (2008) 
 
Acetylcholinesterase
Name:Acetylcholinesterase
Type:Enzyme
Mol. Mass.:67792.70
Organism:Homo sapiens (Human)
Description:P22303
Residue:614
BDBM50110300
NameBDBM50110300
Synonyms:CHEMBL15056 {2-[4-(3-Piperidin-1-yl-propoxy)-phenyl]-ethyl}-(1,2,3,4-tetrahydro-acridin-9-yl)-amine; Oxalic acid
TypeSmall organic molecule
Emp. Form.C29H37N3O
Mol. Mass.443.6236
SMILESC(COc1ccc(CCNc2c3CCCCc3nc3ccccc23)cc1)CN1CCCCC1